{"text_format":"1","workbook":"xlsx","n_sheets":5,"sheets":["Mes","Dependencia","Iniciativa","PLAN DE ACCIÓN INSTITUCIONAL","Hito"],"not_rendered":{"charts":0,"images":0,"macros":0,"external_links":2,"defined_names":4,"comments":3,"pivot_tables":0},"unopened":[],"bounds":{"document_bytes":16777216,"sheet_cells":100000,"rows_first":2000,"rows_last":500,"rows_between":2000,"halvings":0,"cell_chars":16384,"cell_head_chars":4096},"cells_cut":0,"cells_raw":0,"read":"whole","date_system":"1900"}

{"sheet":"Mes","index":0,"n_rows":13,"n_cols":2,"rows_kept":13,"cut":false,"hidden":true,"merged":[]}
["Cod M","Mes "]
[1,"Enero"]
[2,"Febrero"]
[3,"Marzo"]
[4,"Abril"]
[5,"Mayo"]
[6,"Junio"]
[7,"Julio"]
[8,"Agosto"]
[9,"Septiembre"]
{"$rows_left_out":4}
{"sheet":"Dependencia","index":1,"n_rows":104,"n_cols":3,"rows_kept":104,"cut":false,"hidden":true,"merged":[]}
["Cod M","COD","DEPENDENCIA"]
[1,5,"SUBDIRECCIÓN DE ASUNTOS LEGALES - (SAL)"]
[1,6,"SUBDIRECCIÓN ADMINISTRATIVA Y FINANCIERA (SAF)"]
[1,7,"SUBDIRECCIÓN DE RECOLECCIÓN BARRIDO Y LIMPIEZA (SRBL)"]
[1,8,"SUBDIRECCIÓN DE DISPOSICIÓN FINAL - (SDF)"]
[1,10,"SUBDIRECCIÓN DE SERVICIOS FUNERARIOS Y ALUMBRADO PÚBLICO (SSFAP)"]
[2,1,"OFICINA ASESORA DE PLANEACIÓN - (OAP)"]
[2,2,"OFICNA DE CONTROL INETRNO - (OCI)"]
[2,3,"OFICINA ASESORA DE TECNOLOGIAS DE LA INFORMACIÓN - (TIC)"]
[2,4,"SUBDIRECCIÓN DE ASUNTOS LEGALES - (SAL)"]
{"$rows_left_out":95}
{"sheet":"Iniciativa","index":2,"n_rows":211,"n_cols":4,"rows_kept":211,"cut":false,"hidden":true,"merged":[]}
["Cod M","COD D","COD I","Iniciativa"]
[1,1,1,"Asegurar en lo jurídico el fortalecimiento del modelo de transformación organizacional"]
[1,2,1,"Fortalecer el Sistema Integrado de Gestión Financiera    SI-CAPITAL."]
[1,3,1,"Garantizar una adecuada prestación del servicio de aseo"]
[1,4,1,"Fortalecer la gestión de la operación del Relleno Sanitario Doña Juana (RSDJ)"]
[1,4,2,"Fortalecer la Gestión  Social para  la zona de influencia del Relleno Sanitario Doña Juana.\""]
[1,5,1,"Modernizar y Actualizar las luminarias en Parques y Vías"]
[1,5,2,"Fortalecer la prestación del Servicio de Alumbrado Publico en el Distrito Capital"]
[1,5,3,"Garantizar que la prestación de los  servicios funerarios "]
[1,5,4,"Revitalizar los Cementerios de propiedad del Distrito Capital"]
{"$rows_left_out":202}
{"sheet":"PLAN DE ACCIÓN INSTITUCIONAL","index":3,"n_rows":77,"n_cols":56,"rows_kept":77,"cut":false,"hidden":false,"merged":[[67,1,68,1],[34,4,35,4],[9,9,10,9],[9,4,10,4],[9,3,10,3],[21,4,25,4],[12,4,15,4],[16,4,20,4],[39,2,40,2],[39,3,40,3],[30,2,33,2],[28,4,29,4],[28,2,29,2],[28,3,29,3],[59,2,61,2],[59,3,61,3],[0,1,0,55],[1,1,1,54],[2,1,2,55],[3,1,3,9],[3,10,3,13],[3,14,3,16],[3,23,3,25],[3,26,3,28],[3,29,3,31],[3,32,3,34],[3,35,3,37],[3,44,3,46],[3,53,4,53],[3,54,4,54],[3,38,3,39],[71,4,72,4],[73,2,74,2],[73,3,74,3],[5,2,8,2],[9,2,11,2],[34,3,35,3],[55,4,56,4],[52,2,54,2],[52,3,54,3],[52,4,54,4],[41,2,45,2],[41,3,44,3],[67,2,68,2],[67,3,68,3],[75,2,76,2],[75,3,76,3],[12,3,15,3],[16,3,20,3],[49,2,50,2],[55,2,56,2],[55,3,56,3],[12,2,15,2],[16,2,20,2],[21,2,26,2],[21,3,25,3],[34,2,37,2],[69,2,72,2],[64,2,66,2],[64,3,66,3],[71,3,72,3]]}
[null,"UNIDAD ADMINISTRATIVA ESPECIAL DE SERVICIOS PÚBLICOS- UAESP"]
[null,"PROCESO DE DIRECCIONAMIENTO ESTRATÉGICO"]
[null,"PLAN DE ACCIÓN INSTITUCIONAL VIGENCIA 2019  - Versión 2"]
[null,null,null,null,null,null,null,null,null,null,"PLAN ESTRATÉGICO INSTITUCIONAL",null,null,null,"PLAN DE DESARROLLO",null,null,null,"ENERO",null,null,"FEBRERO",null,"MARZO",null,null,"ABRIL",null,null,"MAYO",null,null,"JUNIO",null,null,"JULIO",null,null,"AGOSTO",null,null,null,"SEPTIEMBRE",null,"OCTUBRE",null,null,null,"NOVIEMBRE",null,null,"DICIEMBRE",null,"ACUMULADO FRENTE AL CUMPLIMIENTO DEL HITO","ACUMULADO FRENTE AL CUMPLIMIENTO DE LA INICIATIVA"]
[null,"Dependencia","Iniciativa (Plan o Proyecto)","Meta","Indicador de la meta","Hitos Claves","% incidencia en la meta","Fecha inicio del hito","Fecha final del hito","Entregable del hito","Proyecto de inversión","Meta proyecto de inversión","Objetivo estratégico","Integración y asociación a los planes de la entidad.","Pilar / Eje","Programa","Meta PDD","Descripción cualitativa del avance  ","% Programado \nrespecto al Hito","%  ejecutado","Descripción cualitativa del avance  ","% Programado \nrespecto al Hito","% \nEjecutado","Descripción cualitativa del avance  ","% Programado \nrespecto al Hito","% \nEjecutado","Descripción cualitativa del avance  ","% Programado \nrespecto al Hito","% \nEjecutado","Descripción cualitativa del avance  ","% Programado \nrespecto al Hito","% \nEjecutado","Descripción cualitativa del avance  ","% Programado \nrespecto al Hito","% \nEjecutado","Descripción cualitativa del avance  ","% Programado \nrespecto al Hito","% \nEjecutado","Descripción cualitativa del avance  ","% Programado \nrespecto al Hito","% \nEjecutado","Descripción cualitativa del avance  ","% Programado \nrespecto al Hito","% \nEjecutado","Descripción cualitativa del avance  ","% Programado \nrespecto al Hito","% \nEjecutado","Descripción cualitativa del avance  ","% Programado \nrespecto al Hito","% \nEjecutado","Descripción cualitativa del avance  ","% Programado \nrespecto al Hito","% \nEjecutado"]
[null,"OFICINA ASESORA DE PLANEACIÓN - (OAP)","Fortalecer los estándares de transparencia y de acceso a la información pública","Mantener y/o disminuir el nivel del riesgo del índice de transparencia a de Bogotá D.C.","Resultado del índice de transparencia","Cumplir con los estándares del índice de transparencia de Bogotá",1,"2020-01-01","2020-12-31","1 Informe semestral de seguimiento al Índice de Transparencia","1042-Fortalecimiento institucional en la gestión pública ","Desarrollar y fortalecer el modelo el transformación organizacional de la entidad.","Fortalecimiento Institucional: Consolidar una entidad moderna y efectiva constituida por un equipo comprometido con el logro de los objetivos institucionales","Plan Anticorrupción y de Atención al Ciudadano","Eje 7 - Gobierno Legítimo, fortalecimiento local y eficiencia","42 - Transparencia, gestión pública y servicio a la ciudadanía.","Gestionar el 100% del plan de adecuación y sostenibilidad SIG-MIPG",{"$f":"IFERROR(VLOOKUP($F6,#REF!,3,0),\"\")","v":""},null,{"$f":"IFERROR(VLOOKUP($F6,#REF!,2,0)/100,\"0\")","v":"0"},{"$f":"IFERROR(VLOOKUP($F6,#REF!,3,0),\"\")","v":""},null,{"$f":"IFERROR(VLOOKUP($F6,#REF!,2,0)/100,\"0\")","v":"0"},{"$f":"IFERROR(VLOOKUP($F6,#REF!,3,0),\"\")","v":""},0.3,{"$f":"IFERROR(VLOOKUP($F6,#REF!,2,0)/100,\"0\")","v":"0"},{"$f":"IFERROR(VLOOKUP($F6,#REF!,3,0),\"\")","v":""},0.14000000000000001,{"$f":"IFERROR(VLOOKUP($F6,#REF!,2,0)/100,\"0\")","v":"0"},{"$f":"IFERROR(VLOOKUP($F6,#REF!,3,0),\"\")","v":""},null,{"$f":"IFERROR(VLOOKUP($F6,#REF!,2,0)/100,\"0\")","v":"0"},{"$f":"IFERROR(VLOOKUP($F6,#REF!,3,0),\"\")","v":""},0.14000000000000001,{"$f":"IFERROR(VLOOKUP($F6,#REF!,2,0)/100,\"0\")","v":"0"},{"$f":"IFERROR(VLOOKUP($F6,#REF!,3,0),\"\")","v":""},null,{"$f":"IFERROR(VLOOKUP($F6,#REF!,2,0)/100,\"0\")","v":"0"},{"$f":"IFERROR(VLOOKUP($F6,#REF!,3,0),\"\")","v":""},0.14000000000000001,{"$f":"IFERROR(VLOOKUP($F6,#REF!,2,0)/100,\"0\")","v":"0"},{"$f":"IFERROR(VLOOKUP($F6,#REF!,3,0),\"\")","v":""},null,{"$f":"IFERROR(VLOOKUP($F6,#REF!,2,0)/100,\"0\")","v":"0"},{"$f":"IFERROR(VLOOKUP($F6,#REF!,3,0),\"\")","v":""},0.14000000000000001,{"$f":"IFERROR(VLOOKUP($F6,#REF!,2,0)/100,\"0\")","v":"0"},{"$f":"IFERROR(VLOOKUP($F6,#REF!,3,0),\"\")","v":""},null,{"$f":"IFERROR(VLOOKUP($F6,#REF!,2,0)/100,\"0\")","v":"0"},{"$f":"IFERROR(VLOOKUP($F6,#REF!,3,0),\"\")","v":""},0.14000000000000001,{"$f":"IFERROR(VLOOKUP($F6,#REF!,2,0)/100,\"0\")","v":"0"},{"$f":"T6+W6+Z6+AC6+AF6+AI6+AL6+AO6+AR6+AU6+AX6+BA6","v":0},{"$f":"((T6+W6+Z6+AC6+AF6+AI6+AL6+AO6+AR6+AU6+AX6+BA6)*G6)","v":0}]
[null,"OFICINA ASESORA DE PLANEACIÓN - (OAP)",null,"Cumplimiento del 100% de la estrategia de rendición de cuentas","Informe de seguimiento de la estrategia de rendición de cuentas publicado ","Formular, implementar y realizar seguimiento a la estrategia de rendición de cuentas",1,"2020-01-01","2020-12-31","Informe de seguimiento a la estrategia de rendición de cuentas de la Unidad","1042-Fortalecimiento institucional en la gestión pública ","Desarrollar y fortalecer el modelo el transformación organizacional de la entidad.","Fortalecimiento Institucional: Consolidar una entidad moderna y efectiva constituida por un equipo comprometido con el logro de los objetivos institucionales","Plan Anticorrupción y de Atención al Ciudadano","Eje 7 - Gobierno Legítimo, fortalecimiento local y eficiencia","42 - Transparencia, gestión pública y servicio a la ciudadanía.","Gestionar el 100% del plan de adecuación y sostenibilidad SIG-MIPG",{"$f":"IFERROR(VLOOKUP($F7,#REF!,3,0),\"\")","v":""},null,{"$f":"IFERROR(VLOOKUP($F7,#REF!,2,0)/100,\"0\")","v":"0"},{"$f":"IFERROR(VLOOKUP($F7,#REF!,3,0),\"\")","v":""},null,{"$f":"IFERROR(VLOOKUP($F7,#REF!,2,0)/100,\"0\")","v":"0"},{"$f":"IFERROR(VLOOKUP($F7,#REF!,3,0),\"\")","v":""},0.25,{"$f":"IFERROR(VLOOKUP($F7,#REF!,2,0)/100,\"0\")","v":"0"},{"$f":"IFERROR(VLOOKUP($F7,#REF!,3,0),\"\")","v":""},null,{"$f":"IFERROR(VLOOKUP($F7,#REF!,2,0)/100,\"0\")","v":"0"},{"$f":"IFERROR(VLOOKUP($F7,#REF!,3,0),\"\")","v":""},null,{"$f":"IFERROR(VLOOKUP($F7,#REF!,2,0)/100,\"0\")","v":"0"},{"$f":"IFERROR(VLOOKUP($F7,#REF!,3,0),\"\")","v":""},0.25,{"$f":"IFERROR(VLOOKUP($F7,#REF!,2,0)/100,\"0\")","v":"0"},{"$f":"IFERROR(VLOOKUP($F7,#REF!,3,0),\"\")","v":""},null,{"$f":"IFERROR(VLOOKUP($F7,#REF!,2,0)/100,\"0\")","v":"0"},{"$f":"IFERROR(VLOOKUP($F7,#REF!,3,0),\"\")","v":""},null,{"$f":"IFERROR(VLOOKUP($F7,#REF!,2,0)/100,\"0\")","v":"0"},{"$f":"IFERROR(VLOOKUP($F7,#REF!,3,0),\"\")","v":""},0.25,{"$f":"IFERROR(VLOOKUP($F7,#REF!,2,0)/100,\"0\")","v":"0"},{"$f":"IFERROR(VLOOKUP($F7,#REF!,3,0),\"\")","v":""},null,{"$f":"IFERROR(VLOOKUP($F7,#REF!,2,0)/100,\"0\")","v":"0"},{"$f":"IFERROR(VLOOKUP($F7,#REF!,3,0),\"\")","v":""},null,{"$f":"IFERROR(VLOOKUP($F7,#REF!,2,0)/100,\"0\")","v":"0"},{"$f":"IFERROR(VLOOKUP($F7,#REF!,3,0),\"\")","v":""},0.25,{"$f":"IFERROR(VLOOKUP($F7,#REF!,2,0)/100,\"0\")","v":"0"},{"$f":"T7+W7+Z7+AC7+AF7+AI7+AL7+AO7+AR7+AU7+AX7+BA7","v":0},{"$f":"((T7+W7+Z7+AC7+AF7+AI7+AL7+AO7+AR7+AU7+AX7+BA7)*G7)","v":0}]
[null,"OFICINA ASESORA DE PLANEACIÓN - (OAP)",null,"Fortalecer la implementación del PAAC","Monitoreos realizados","Formular y monitorear el Plan Anticorrupción y Atención al Ciudadano",1,"2020-01-01","2020-12-31","Evidencias de monitoreo realizado al PAAC","1042-Fortalecimiento institucional en la gestión pública ","Desarrollar y fortalecer el modelo el transformación organizacional de la entidad.","Fortalecimiento Institucional: Consolidar una entidad moderna y efectiva constituida por un equipo comprometido con el logro de los objetivos institucionales","Plan Anticorrupción y de Atención al Ciudadano","Eje 7 - Gobierno Legítimo, fortalecimiento local y eficiencia","42 - Transparencia, gestión pública y servicio a la ciudadanía.","Gestionar el 100% del plan de adecuación y sostenibilidad SIG-MIPG",{"$f":"IFERROR(VLOOKUP($F8,#REF!,3,0),\"\")","v":""},null,{"$f":"IFERROR(VLOOKUP($F8,#REF!,2,0)/100,\"0\")","v":"0"},{"$f":"IFERROR(VLOOKUP($F8,#REF!,3,0),\"\")","v":""},0.3,0,{"$f":"IFERROR(VLOOKUP($F8,#REF!,3,0),\"\")","v":""},null,{"$f":"IFERROR(VLOOKUP($F8,#REF!,2,0)/100,\"0\")","v":"0"},{"$f":"IFERROR(VLOOKUP($F8,#REF!,3,0),\"\")","v":""},0.14000000000000001,{"$f":"IFERROR(VLOOKUP($F8,#REF!,2,0)/100,\"0\")","v":"0"},{"$f":"IFERROR(VLOOKUP($F8,#REF!,3,0),\"\")","v":""},null,{"$f":"IFERROR(VLOOKUP($F8,#REF!,2,0)/100,\"0\")","v":"0"},{"$f":"IFERROR(VLOOKUP($F8,#REF!,3,0),\"\")","v":""},0.14000000000000001,{"$f":"IFERROR(VLOOKUP($F8,#REF!,2,0)/100,\"0\")","v":"0"},{"$f":"IFERROR(VLOOKUP($F8,#REF!,3,0),\"\")","v":""},null,{"$f":"IFERROR(VLOOKUP($F8,#REF!,2,0)/100,\"0\")","v":"0"},{"$f":"IFERROR(VLOOKUP($F8,#REF!,3,0),\"\")","v":""},0.14000000000000001,{"$f":"IFERROR(VLOOKUP($F8,#REF!,2,0)/100,\"0\")","v":"0"},{"$f":"IFERROR(VLOOKUP($F8,#REF!,3,0),\"\")","v":""},null,{"$f":"IFERROR(VLOOKUP($F8,#REF!,2,0)/100,\"0\")","v":"0"},{"$f":"IFERROR(VLOOKUP($F8,#REF!,3,0),\"\")","v":""},0.14000000000000001,{"$f":"IFERROR(VLOOKUP($F8,#REF!,2,0)/100,\"0\")","v":"0"},{"$f":"IFERROR(VLOOKUP($F8,#REF!,3,0),\"\")","v":""},null,{"$f":"IFERROR(VLOOKUP($F8,#REF!,2,0)/100,\"0\")","v":"0"},{"$f":"IFERROR(VLOOKUP($F8,#REF!,3,0),\"\")","v":""},0.14000000000000001,{"$f":"IFERROR(VLOOKUP($F8,#REF!,2,0)/100,\"0\")","v":"0"},0,0]
[null,"OFICINA ASESORA DE PLANEACIÓN - (OAP)",null,"Fortalecer la participación ciudadana de la entidad .","Monitoreos realizados","Formular, implementar y realizar seguimiento al Plan de Acción de Participación Ciudadana.",1,"2020-01-01","2020-12-31","Informe de seguimiento al Plan de Acción de Participación Ciudadana","1042-Fortalecimiento institucional en la gestión pública ","Desarrollar y fortalecer el modelo el transformación organizacional de la entidad.","Fortalecimiento Institucional: Consolidar una entidad moderna y efectiva constituida por un equipo comprometido con el logro de los objetivos institucionales","Plan Anticorrupción y de Atención al Ciudadano","Eje 7 - Gobierno Legítimo, fortalecimiento local y eficiencia","42 - Transparencia, gestión pública y servicio a la ciudadanía.","Gestionar el 100% del plan de adecuación y sostenibilidad SIG-MIPG",{"$f":"IFERROR(VLOOKUP($F9,#REF!,3,0),\"\")","v":""},null,{"$f":"IFERROR(VLOOKUP($F9,#REF!,2,0)/100,\"0\")","v":"0"},{"$f":"IFERROR(VLOOKUP($F9,#REF!,3,0),\"\")","v":""},null,{"$f":"IFERROR(VLOOKUP($F9,#REF!,2,0)/100,\"0\")","v":"0"},{"$f":"IFERROR(VLOOKUP($F9,#REF!,3,0),\"\")","v":""},null,{"$f":"IFERROR(VLOOKUP($F9,#REF!,2,0)/100,\"0\")","v":"0"},{"$f":"IFERROR(VLOOKUP($F9,#REF!,3,0),\"\")","v":""},0.25,{"$f":"IFERROR(VLOOKUP($F9,#REF!,2,0)/100,\"0\")","v":"0"},{"$f":"IFERROR(VLOOKUP($F9,#REF!,3,0),\"\")","v":""},null,{"$f":"IFERROR(VLOOKUP($F9,#REF!,2,0)/100,\"0\")","v":"0"},{"$f":"IFERROR(VLOOKUP($F9,#REF!,3,0),\"\")","v":""},null,{"$f":"IFERROR(VLOOKUP($F9,#REF!,2,0)/100,\"0\")","v":"0"},{"$f":"IFERROR(VLOOKUP($F9,#REF!,3,0),\"\")","v":""},0.25,{"$f":"IFERROR(VLOOKUP($F9,#REF!,2,0)/100,\"0\")","v":"0"},{"$f":"IFERROR(VLOOKUP($F9,#REF!,3,0),\"\")","v":""},null,{"$f":"IFERROR(VLOOKUP($F9,#REF!,2,0)/100,\"0\")","v":"0"},{"$f":"IFERROR(VLOOKUP($F9,#REF!,3,0),\"\")","v":""},null,{"$f":"IFERROR(VLOOKUP($F9,#REF!,2,0)/100,\"0\")","v":"0"},{"$f":"IFERROR(VLOOKUP($F9,#REF!,3,0),\"\")","v":""},0.25,{"$f":"IFERROR(VLOOKUP($F9,#REF!,2,0)/100,\"0\")","v":"0"},{"$f":"IFERROR(VLOOKUP($F9,#REF!,3,0),\"\")","v":""},null,{"$f":"IFERROR(VLOOKUP($F9,#REF!,2,0)/100,\"0\")","v":"0"},{"$f":"IFERROR(VLOOKUP($F9,#REF!,3,0),\"\")","v":""},0.25,{"$f":"IFERROR(VLOOKUP($F9,#REF!,2,0)/100,\"0\")","v":"0"},0,0]
[null,"OFICINA ASESORA DE PLANEACIÓN - (OAP)","Fortalecer el Modelo de Transformación Organizacional articulado con el Modelo Integrado de Planeación y Gestión (MIPG)","Implementación de MIPG en la UAESP de acuerdo con el Plan de Desarrollo de la Vigencia","Mantenimiento y sostenibilidad del MIPG","Seguimiento a la implementación de las 17 políticas de gestión y desempeño institucional",0.5,"2020-01-02","2020-12-31","1 informe de avance trimestral del cumplimiento de los estándares del MIPG","1042-Fortalecimiento institucional en la gestión pública ","Desarrollar y fortalecer el modelo el transformación organizacional de la entidad.","Fortalecimiento Institucional: Consolidar una entidad moderna y efectiva constituida por un equipo comprometido con el logro de los objetivos institucionales","Plan Anticorrupción y de Atención al Ciudadano","Eje 7 - Gobierno Legítimo, fortalecimiento local y eficiencia","42 - Transparencia, gestión pública y servicio a la ciudadanía.","Gestionar el 100% del plan de adecuación y sostenibilidad SIG-MIPG",{"$f":"IFERROR(VLOOKUP($F10,#REF!,3,0),\"\")","v":""},null,{"$f":"IFERROR(VLOOKUP($F10,#REF!,2,0)/100,\"0\")","v":"0"},{"$f":"IFERROR(VLOOKUP($F10,#REF!,3,0),\"\")","v":""},null,{"$f":"IFERROR(VLOOKUP($F10,#REF!,2,0)/100,\"0\")","v":"0"},{"$f":"IFERROR(VLOOKUP($F10,#REF!,3,0),\"\")","v":""},0.25,{"$f":"IFERROR(VLOOKUP($F10,#REF!,2,0)/100,\"0\")","v":"0"},{"$f":"IFERROR(VLOOKUP($F10,#REF!,3,0),\"\")","v":""},null,{"$f":"IFERROR(VLOOKUP($F10,#REF!,2,0)/100,\"0\")","v":"0"},{"$f":"IFERROR(VLOOKUP($F10,#REF!,3,0),\"\")","v":""},null,{"$f":"IFERROR(VLOOKUP($F10,#REF!,2,0)/100,\"0\")","v":"0"},{"$f":"IFERROR(VLOOKUP($F10,#REF!,3,0),\"\")","v":""},0.25,{"$f":"IFERROR(VLOOKUP($F10,#REF!,2,0)/100,\"0\")","v":"0"},{"$f":"IFERROR(VLOOKUP($F10,#REF!,3,0),\"\")","v":""},null,{"$f":"IFERROR(VLOOKUP($F10,#REF!,2,0)/100,\"0\")","v":"0"},{"$f":"IFERROR(VLOOKUP($F10,#REF!,3,0),\"\")","v":""},null,{"$f":"IFERROR(VLOOKUP($F10,#REF!,2,0)/100,\"0\")","v":"0"},{"$f":"IFERROR(VLOOKUP($F10,#REF!,3,0),\"\")","v":""},0.25,{"$f":"IFERROR(VLOOKUP($F10,#REF!,2,0)/100,\"0\")","v":"0"},{"$f":"IFERROR(VLOOKUP($F10,#REF!,3,0),\"\")","v":""},null,{"$f":"IFERROR(VLOOKUP($F10,#REF!,2,0)/100,\"0\")","v":"0"},{"$f":"IFERROR(VLOOKUP($F10,#REF!,3,0),\"\")","v":""},null,{"$f":"IFERROR(VLOOKUP($F10,#REF!,2,0)/100,\"0\")","v":"0"},{"$f":"IFERROR(VLOOKUP($F10,#REF!,3,0),\"\")","v":""},0.25,{"$f":"IFERROR(VLOOKUP($F10,#REF!,2,0)/100,\"0\")","v":"0"},0,0]
{"$rows_left_out":68}
{"sheet":"Hito","index":4,"n_rows":443,"n_cols":5,"rows_kept":443,"cut":false,"hidden":true,"merged":[]}
["Cod M","Cod D","Cod I","Meta ","Hitos Claves"]
[1,1,1,"Publicar el 100% de las actuaciones derivadas de los contratos suscritos por la Unidad","Publicación de  los procesos de contratación en el sistema de compra pública."]
[1,2,1,"Optimizar la utilización de los módulos que conforman el aplicativo SI-CAPITAL","Seguimiento a la integración de los módulos que conforman el aplicativo SI-CAPITAL"]
[1,3,1,"Cumplir  con las obligaciones y reglamentación del esquema de aseo de Bogotá D.C.","Contar con el plan de supervisión   y control del servicio de  aseo aprobado  y ejecución  del plan de supervisión y control "]
[1,3,1,"Cumplir  con las obligaciones y reglamentación del esquema de aseo de Bogotá D.C.","Contar con el plan de supervisión   y control del servicio de  hospitalarios aprobado  y ejecución  del plan de supervisión y control  del servicio de hospitalarios."]
[1,4,1,"Realizar el 100% del seguimiento a la operación del R.S.D.J","Seguimiento al  trámite de licencia ambiental para optimización del RSDJ"]
[1,4,1,"Realizar el 100% del seguimiento a la operación del R.S.D.J","Seguimiento al cumplimiento del laudo arbitral por parte del operador del RSDJ"]
[1,4,1,"Realizar el 100% del seguimiento a la operación del R.S.D.J","Presentación informe supervisión y control SDF."]
[1,4,2,"Garantizar  que el 90% de la población seleccionada acceda a los programas del Plan de Gestión social ","Cumplir  con las actividades asociadas al  plan de gestión social"]
[1,4,2,"Garantizar  que el 90% de la población seleccionada acceda a los programas del Plan de Gestión social ","Cumplir con las actividades establecidas en el Plan de acción y seguimiento de gestión social"]
{"$rows_left_out":433}